Target
D(4) dopamine receptor
Ligand
BDBM186925
Substrate
Meas. Tech.
Radioligand Binding Assay
pH
7.4±n/a
Ki
1931±n/a nM
Comments
extracted
Citation
 Besnard, JHopkins, ALGilbert, IRuda, GFAbecassis, K Morpholino compounds, uses and methods US Patent  US9079895 Publication Date 7/14/2015 
Target
Name:
D(4) dopamine receptor
Synonyms:
DRD4_MOUSE Drd4
Type:
Enzyme
Mol. Mass.:
41498.73
Organism:
Mus musculus (Mouse)
Description:
P51436
Residue:
387
  
Inhibitor
Name:
BDBM186925
Synonyms:
US9079895, 17r
Type:
Small organic molecule
Emp. Form.:
C21H27N3O2
Mol. Mass.:
353.458
SMILES:
Cc1ccnc(OC[C@H]2CN(CCN3CCc4ccccc34)CCO2)c1
: