Target
D(4) dopamine receptor
Ligand
BDBM186930
Substrate
Meas. Tech.
Radioligand Binding Assay
pH
7.4±n/a
Ki
182±n/a nM
Comments
extracted
Citation
 Besnard, JHopkins, ALGilbert, IRuda, GFAbecassis, K Morpholino compounds, uses and methods US Patent  US9079895 Publication Date 7/14/2015 
Target
Name:
D(4) dopamine receptor
Synonyms:
DRD4_MOUSE Drd4
Type:
Enzyme
Mol. Mass.:
41498.73
Organism:
Mus musculus (Mouse)
Description:
P51436
Residue:
387
  
Inhibitor
Name:
BDBM186930
Synonyms:
US9079895, 20s | US9079895, 21s
Type:
Small organic molecule
Emp. Form.:
C20H23N3O3
Mol. Mass.:
353.4149
SMILES:
O=C(CN1CCO[C@H](COc2cccnc2)C1)N1CCc2ccccc12
: