Target
Cytochrome P450 2B6
Ligand
BDBM50113851
Substrate
Meas. Tech.
Fluorescent High Throughput P450 Assay
IC50
6900±1200 nM
Citation
 Maj, RPattarino, FMura, EBarberis, A Phospholipid drug analogs US Patent  US9173935 Publication Date 11/3/2015 
Target
Name:
Cytochrome P450 2B6
Synonyms:
CP2B6_HUMAN Cytochrome P450 2B6 (CYP2B6)
Type:
Protein
Mol. Mass.:
56289.75
Organism:
Homo sapiens (Human)
Description:
P20813
Residue:
491
  
Inhibitor
Name:
BDBM50113851
Synonyms:
(+/-)-Tranylcypromine 2-Phenyl-cyclopropylamine CHEMBL313833 Tranylcypromine,(+) US8609708, 6 Tranyl- cypromine | US8609708, 6 Tranylcypromine
Type:
Small organic molecule
Emp. Form.:
C9H11N
Mol. Mass.:
133.1903
SMILES:
NC1CC1c1ccccc1
: