Target
Glycogen synthase kinase-3 beta
Ligand
BDBM189391
Substrate
Meas. Tech.
Kinase-Glo Assay
Temperature
303.15±n/a K
IC50
2.844e+4± 2.20e+3 nM
Comments
extracted
Citation
 Tantray, MAKhan, IHamid, HAlam, MSUmar, SAli, YSharma, KHussain, F Synthesis of Novel Oxazolo[4,5-b]pyridine-2-one based 1,2,3-triazoles as Glycogen Synthase Kinase-3ß Inhibitors with Anti-inflammatory Potential. Chem Biol Drug Des 87:918-26 (2016)  
Target
Name:
Glycogen synthase kinase-3 beta
Synonyms:
GSK-3 beta GSK3B Glycogen synthase kinase 3 beta (GSK3B) Glycogen synthase kinase-3 beta (GSK-3B) Glycogen synthase kinase-3 beta (GSK3B) Glycogen synthase kinase-3beta (GSK3B) | Serine/threonine-protein kinase GSK3B
Type:
Enzyme
Mol. Mass.:
46756.38
Organism:
Homo sapiens (Human)
Description:
P49841
Residue:
420
  
Inhibitor
Name:
BDBM189391
Synonyms:
3-((1-(3-chlorophenyl)-1H-1,2,3-triazol-4-yl)methyl)oxazolo[4,5-b]pyridin-2(3H)-one (4k)
Type:
Small organic molecule
Emp. Form.:
C15H10ClN5O2
Mol. Mass.:
327.725
SMILES:
Clc1cccc(c1)-n1cc(Cn2c3ncccc3oc2=O)nn1
: