Target
Receptor-interacting serine/threonine-protein kinase 1
Ligand
BDBM288688
Substrate
Meas. Tech.
Kinase Assay of RIPK1
Temperature
298.15±n/a K
Ki
152±n/a nM
Comments
extracted
Citation
 Zhang, ZWang, XSu, YRuan, HRen, Y Necrosis inhibitors US Patent  US10092529 Publication Date 10/9/2018 
Target
Name:
Receptor-interacting serine/threonine-protein kinase 1
Synonyms:
Cell death protein RIP RIP-1 RIPK1 Receptor-interacting protein 1
Type:
Enzyme Catalytic Domain
Mol. Mass.:
75926.99
Organism:
Homo sapiens (Human)
Description:
Q13546
Residue:
671
  
Inhibitor
Name:
BDBM288688
Synonyms:
TC001273 | US10092529, Compound 25
Type:
Small organic molecule
Emp. Form.:
C15H18N4O2
Mol. Mass.:
286.329
SMILES:
CCC(C)(C)C(=O)N1C(CC1=O)c1cccc(c1)N=[N+]=[N-]
: