Target
D-amino-acid oxidase
Ligand
BDBM190366
Substrate
Meas. Tech.
Enzyme Assay
IC50
190±n/a nM
Citation
 Farnaby, WFieldhouse, CKerr, CKinsella, NLivermore, DMerchant, KMiller, DHazel, K 5- or 6-substituted 3-hydroxy-2 (1 H)-pyridinones as D-amino acid oxidase (DAAO) inhibitors in therapy of diseases such as schizophrenia, cognitive disorder and pain US Patent  US9180122 Publication Date 11/10/2015 
Target
Name:
D-amino-acid oxidase
Synonyms:
D-amino-acid oxidase (DAAO) DAMOX OXDA_HUMAN
Type:
Homodimer
Mol. Mass.:
39476.06
Organism:
Homo sapiens (Human)
Description:
P14920
Residue:
347
  
Inhibitor
Name:
BDBM190366
Synonyms:
US9180122, 1
Type:
Small organic molecule
Emp. Form.:
C12H11NO2S
Mol. Mass.:
233.286
SMILES:
Oc1cc(SCc2ccccc2)c[nH]c1=O
: