Target
Lysosomal alpha-glucosidase
Ligand
BDBM18355
Substrate
Meas. Tech.
Enzyme Activity Assay
pH
4±n/a
EC50
11800±2200 nM
Comments
extracted
Citation
 Mugrage, BLee, GZhu, XBoyd, RSheth, K Method for the treatment of pompe disease using 1-deoxynojirimycin and derivatives US Patent  US9181184 Publication Date 11/10/2015 
Target
Name:
Lysosomal alpha-glucosidase
Synonyms:
α-Glucosidase Gaa Lysosomal alpha-glucosidase | alpha-glucosidase (Gaa)
Type:
Enzyme
Mol. Mass.:
106235.32
Organism:
Mus musculus (Mouse)
Description:
P70699
Residue:
953
  
Inhibitor
Name:
BDBM18355
Synonyms:
(2R,3R,4R,5S)-1-butyl-2-(hydroxymethyl)piperidine-3,4,5-triol MIGLUSTAT US20230339856, Compound NB-DNJ | US9181184, 5
Type:
Small organic molecule
Emp. Form.:
C10H21NO4
Mol. Mass.:
219.278
SMILES:
CCCCN1C[C@H](O)[C@@H](O)[C@H](O)[C@H]1CO
: