Target
Lysosomal alpha-glucosidase
Ligand
BDBM190538
Substrate
Meas. Tech.
Enzyme Activity Assay
pH
4±n/a
EC50
66500±6200 nM
Comments
extracted
Citation
 Mugrage, BLee, GZhu, XBoyd, RSheth, K Method for the treatment of pompe disease using 1-deoxynojirimycin and derivatives US Patent  US9181184 Publication Date 11/10/2015 
Target
Name:
Lysosomal alpha-glucosidase
Synonyms:
α-Glucosidase Gaa Lysosomal alpha-glucosidase | alpha-glucosidase (Gaa)
Type:
Enzyme
Mol. Mass.:
106235.32
Organism:
Mus musculus (Mouse)
Description:
P70699
Residue:
953
  
Inhibitor
Name:
BDBM190538
Synonyms:
US9181184, 25
Type:
Small organic molecule
Emp. Form.:
C14H18F3NO5
Mol. Mass.:
337.2916
SMILES:
OC[C@@H]1[C@@H](O)[C@H](O)[C@@H](O)CN1Cc1ccc(OC(F)(F)F)cc1
: