Target
Adenosine receptor A1
Ligand
BDBM191057
Substrate
Meas. Tech.
Radioligand Binding Assay
pH
7.5±n/a
Temperature
298.15±n/a K
Ki
68.4±8.9 nM
Comments
extracted
Citation
 Jacobson, KATosh, DK Adenosine receptor agonists, partial agonists, and antagonists US Patent  US9181253 Publication Date 11/10/2015 
Target
Name:
Adenosine receptor A1
Synonyms:
A1 adenosine receptor (hA1) AA1R_HUMAN ADORA1 Adenosine A1-receptor Adenosine receptor A1 (hA1) | Adenosine transporter (AdT)
Type:
G Protein-Coupled Receptor (GPCR)
Mol. Mass.:
36520.92
Organism:
Homo sapiens (Human)
Description:
P30542
Residue:
326
  
Inhibitor
Name:
BDBM191057
Synonyms:
US9181253, 119
Type:
Small organic molecule
Emp. Form.:
C15H18ClN5O2
Mol. Mass.:
335.789
SMILES:
O[C@H]1C[C@]2(C[C@H]2[C@H]1O)n1cnc2c(NCC3CC3)nc(Cl)nc12
: