Target
Poly [ADP-ribose] polymerase tankyrase-1
Ligand
BDBM191195
Substrate
Meas. Tech.
Biochemical Assay
Temperature
298.15±n/a K
IC50
10±1.4 nM
Comments
extracted
Citation
 Cheung, AKChin, DNFan, JMiller-Moslin, KMShultz, MDSmith, TDTomlinson, RCToure, BVisser, MSChen, Z 2-piperidin-1-yl-acetamide compounds for use as tankyrase inhibitors US Patent  US9181266 Publication Date 11/10/2015 
Target
Name:
Poly [ADP-ribose] polymerase tankyrase-1
Synonyms:
(ARTD5 or PARP5a) PARPL Poly [ADP-ribose] polymerase tankyrase-1 TINF1 TNKS1 Tankyrase 1 Tankyrase-1 Tankyrase-1 (TNKS1)
Type:
Enzyme
Mol. Mass.:
142058.03
Organism:
Homo sapiens (Human)
Description:
O95271
Residue:
1327
  
Inhibitor
Name:
BDBM191195
Synonyms:
US9181266, 64
Type:
Small organic molecule
Emp. Form.:
C26H30F2N4O5
Mol. Mass.:
516.537
SMILES:
COc1ccc2C(=O)C3(Cc2c1)CCN(CC(=O)N(CC(F)F)Cc1nc2CCOCc2c(=O)[nH]1)CC3
: