Target
Mast/stem cell growth factor receptor Kit
Ligand
BDBM193944
Substrate
Meas. Tech.
Cell Proliferation Assay
IC50
3±n/a nM
Citation
 Yeh, VLi, XLiu, XLoren, JMolteni, VNabakka, JNguyen, BPetrassi, HM Compounds and compositions as C-kit kinase inhibitors US Patent  US9199981 Publication Date 12/1/2015 
Target
Name:
Mast/stem cell growth factor receptor Kit
Synonyms:
CD117 antigen KIT Mast/stem cell growth factor receptor Kit (cKIT) Proto-oncogene tyrosine-protein kinase Kit Stem cell growth factor receptor Tyrosine-protein kinase Kit c-kit v-kit Hardy-Zuckerman 4 feline sarcoma viral oncogene homolog
Type:
Protein
Mol. Mass.:
109869.37
Organism:
Homo sapiens (Human)
Description:
P10721
Residue:
976
  
Inhibitor
Name:
BDBM193944
Synonyms:
US9199981, F35
Type:
Small organic molecule
Emp. Form.:
C22H17F4N5O3
Mol. Mass.:
475.3957
SMILES:
Cc1ccc(cc1NC(=O)c1cnc2ccccn12)-c1noc(COC2CC(F)(F)C2(F)F)n1
: