Target
A disintegrin and metalloproteinase with thrombospondin motifs 4
Ligand
BDBM194645
Substrate
Meas. Tech.
AlphaScreen Assay
pH
7.5±n/a
Temperature
298.15±n/a K
IC50
14±n/a nM
Comments
extracted
Citation
 Durham, TBMarimuthu, JWiley, MR Aggrecanase inhibitors US Patent  US9206139 Publication Date 12/8/2015 
Target
Name:
A disintegrin and metalloproteinase with thrombospondin motifs 4
Synonyms:
A disintegrin and metalloproteinase with thrombospondin motifs 4 (ADAMTS-4) ATS4_HUMAN KIAA0688 | Metalloproteinase with thrombospondin motifs 4 (ADAMTS-4)
Type:
Enzyme
Mol. Mass.:
90214.54
Organism:
Homo sapiens (Human)
Description:
O75173
Residue:
837
  
Inhibitor
Name:
BDBM194645
Synonyms:
US9206139, 4
Type:
Small organic molecule
Emp. Form.:
C20H24F3N3O3
Mol. Mass.:
411.4181
SMILES:
CC(C)[C@H](Cc1ccc(cc1)C(F)(F)F)C(=O)NC[C@]1(NC(=O)NC1=O)C1CC1
: