Target
72 kDa type IV collagenase
Ligand
BDBM194644
Substrate
Meas. Tech.
In Vitro Fluorescence Assay
pH
7.5±n/a
IC50
35000±n/a nM
Comments
extracted
Citation
 Durham, TBMarimuthu, JWiley, MR Aggrecanase inhibitors US Patent  US9206139 Publication Date 12/8/2015 
Target
Name:
72 kDa type IV collagenase
Synonyms:
72 kDa gelatinase CLG4A Gelatinase A (MMP-2) MMP2_HUMAN Matrix metalloproteinase-2 (MMP 2) Matrix metalloproteinases 2 (MMP-2) | TBE-1
Type:
Enzyme
Mol. Mass.:
73870.36
Organism:
Homo sapiens (Human)
Description:
P08253
Residue:
660
  
Inhibitor
Name:
BDBM194644
Synonyms:
US9206139, 3
Type:
Small organic molecule
Emp. Form.:
C20H22F3N3O3
Mol. Mass.:
409.4022
SMILES:
FC(F)(F)c1ccc(C[C@@H](C2CC2)C(=O)NC[C@]2(NC(=O)NC2=O)C2CC2)cc1
: