Target
Macrophage metalloelastase
Ligand
BDBM194639
Substrate
Meas. Tech.
In Vitro Fluorescence Assay
pH
7.5±n/a
IC50
26±n/a nM
Comments
extracted
Citation
 Durham, TBMarimuthu, JWiley, MR Aggrecanase inhibitors US Patent  US9206139 Publication Date 12/8/2015 
Target
Name:
Macrophage metalloelastase
Synonyms:
HME MMP12_HUMAN Matrix metalloproteinase-12 (MMP 12) Matrix metalloproteinase-12 (MMP12) | Matrix metalloproteinases 12 (MMP-12)
Type:
Enzyme
Mol. Mass.:
54012.99
Organism:
Homo sapiens (Human)
Description:
P39900
Residue:
470
  
Inhibitor
Name:
BDBM194639
Synonyms:
US9206139, 2
Type:
Small organic molecule
Emp. Form.:
C19H22F3N3O3
Mol. Mass.:
397.3915
SMILES:
CC[C@H](Cc1ccc(cc1)C(F)(F)F)C(=O)NC[C@]1(NC(=O)NC1=O)C1CC1
: