Target
Isocitrate dehydrogenase [NADP] cytoplasmic [R132C]
Ligand
BDBM195601
Substrate
Meas. Tech.
RapidFire-MS/MS and NADPH Assays
Temperature
298.15±n/a K
IC50
3.8±0.0 nM
Comments
extracted
Target
Name:
Isocitrate dehydrogenase [NADP] cytoplasmic [R132C]
Synonyms:
IDH1 IDH1(R132C) Isocitrate dehydrogenase (IDH1)(R132C) Isocitrate dehydrogenase [NADP] cytoplasmic (IDH1) (R132C) | PICD
Type:
Enzyme Catalytic Domain
Mol. Mass.:
46607.23
Organism:
Homo sapiens (Human)
Description:
O75874[R132C]
Residue:
414
  
Inhibitor
Name:
BDBM195601
Synonyms:
GSK321 US11376246, Cpd ID GSK321 | US11576906, Compound GSK321
Type:
Small organic molecule
Emp. Form.:
C28H28FN5O3
Mol. Mass.:
501.552
SMILES:
C[C@H](O)c1cccc(NC(=O)c2nn(Cc3ccc(F)cc3)c3[C@H](C)CN(Cc23)C(=O)c2ccc[nH]2)c1
: