Target
Lysine-specific demethylase 3B
Ligand
BDBM60875
Substrate
Meas. Tech.
KDM TR-FRET Assay
IC50
>25000±n/a nM
Citation
 Vinogradova, MGehling, VSGustafson, AArora, STindell, CAWilson, CWilliamson, KEGuler, GDGangurde, PManieri, WBusby, JFlynn, EMLan, FKim, HJOdate, SCochran, AGLiu, YWongchenko, MYang, YCheung, TKMaile, TMLau, TCosta, MHegde, GVJackson, EPitti, RArnott, DBailey, CBellon, SCummings, RTAlbrecht, BKHarmange, JCKiefer, JRTrojer, PClasson, M An inhibitor of KDM5 demethylases reduces survival of drug-tolerant cancer cells. Nat Chem Biol 12:531-8 (2016)  
Target
Name:
Lysine-specific demethylase 3B
Synonyms:
C5orf7 JMJD1B KDM3B_HUMAN Lysine-specific demethylase 3B | Lysine-specific demethylase 3B (KDM3B)
Type:
Protein
Mol. Mass.:
191594.20
Organism:
Homo sapiens (Human)
Description:
Q7LBC6
Residue:
1761
  
Inhibitor
Name:
BDBM60875
Synonyms:
3-((6-(4,5-Dihydro-1H-benzo[d]azepin-3(2H)-yl)-2-(pyridin-2-yl)pyrimidin-4-yl)amino)propanoic acid GSK J1 GSKJ1
Type:
Emp. Form.:
C22H23N5O2
Mol. Mass.:
389.4503
SMILES:
OC(=O)CCNc1cc(nc(n1)-c1ccccn1)N1CCc2ccccc2CC1
: