Target
Lysine-specific demethylase 4C [1-350]
Ligand
BDBM195608
Substrate
Meas. Tech.
KDM4C Enzymatic Screening Assay
pH
7.5±n/a
IC50
2.0e+3±n/a nM
Comments
extracted
Citation
 Vinogradova, MGehling, VSGustafson, AArora, STindell, CAWilson, CWilliamson, KEGuler, GDGangurde, PManieri, WBusby, JFlynn, EMLan, FKim, HJOdate, SCochran, AGLiu, YWongchenko, MYang, YCheung, TKMaile, TMLau, TCosta, MHegde, GVJackson, EPitti, RArnott, DBailey, CBellon, SCummings, RTAlbrecht, BKHarmange, JCKiefer, JRTrojer, PClasson, M An inhibitor of KDM5 demethylases reduces survival of drug-tolerant cancer cells. Nat Chem Biol 12:531-8 (2016)  
Target
Name:
Lysine-specific demethylase 4C [1-350]
Synonyms:
GASC1 JMJD2C KDM4C_HUMAN Lysine-specific demethylase 4C (KDM4C)
Type:
Protein
Mol. Mass.:
40626.08
Organism:
Homo sapiens (Human)
Description:
Q9H3R0; His-tagged recombinant KDM4C (1-350) overexpressed in E. coli(DE3)
Residue:
350
  
Inhibitor
Name:
BDBM195608
Synonyms:
CPI-455
Type:
Small organic molecule
Emp. Form.:
C16H14N4O
Mol. Mass.:
278.3086
SMILES:
CC(C)c1c([nH]c2c(cnn2c1=O)C#N)-c1ccccc1
: