Target
Lysine-specific demethylase 6B
Ligand
BDBM26106
Substrate
Meas. Tech.
Demethylase AlphaScreen Assay
pH
7.5±n/a
IC50
6.8e+2±n/a nM
Comments
extracted
Citation
 Johansson, CVelupillai, STumber, ASzykowska, AHookway, ESNowak, RPStrain-Damerell, CGileadi, CPhilpott, MBurgess-Brown, NWu, NKopec, JNuzzi, ASteuber, HEgner, UBadock, VMunro, SLaThangue, NBWestaway, SBrown, JAthanasou, NPrinjha, RBrennan, PEOppermann, U Structural analysis of human KDM5B guides histone demethylase inhibitor development. Nat Chem Biol 12:539-45 (2016)  
Target
Name:
Lysine-specific demethylase 6B
Synonyms:
JMJD3 Jumonji domain-containing protein 3 KDM6B_HUMAN Lysine demethylase 6B Lysine-specific demethylase 6B (KDM6B(JMJD3)) | Lysine-specific demethylase 6B (KDM6B)
Type:
Protein
Mol. Mass.:
176672.55
Organism:
Homo sapiens (Human)
Description:
O15054
Residue:
1643
  
Inhibitor
Name:
BDBM26106
Synonyms:
CHEMBL90852 NOG [(carboxymethyl)carbamoyl]formic acid
Type:
Small organic molecule
Emp. Form.:
C4H5NO5
Mol. Mass.:
147.0862
SMILES:
OC(=O)CNC(=O)C(O)=O
: