Target
Lysine-specific demethylase 5D [1-775]
Ligand
BDBM60875
Substrate
Meas. Tech.
Demethylase AlphaScreen Assay
pH
7.5±n/a
IC50
1.5e+3±n/a nM
Comments
extracted
Citation
 Johansson, CVelupillai, STumber, ASzykowska, AHookway, ESNowak, RPStrain-Damerell, CGileadi, CPhilpott, MBurgess-Brown, NWu, NKopec, JNuzzi, ASteuber, HEgner, UBadock, VMunro, SLaThangue, NBWestaway, SBrown, JAthanasou, NPrinjha, RBrennan, PEOppermann, U Structural analysis of human KDM5B guides histone demethylase inhibitor development. Nat Chem Biol 12:539-45 (2016)  
Target
Name:
Lysine-specific demethylase 5D [1-775]
Synonyms:
HY JARID1D KDM5D_HUMAN Lysine-specific demethylase 5D (KDM5D) | SMCY
Type:
Protein
Mol. Mass.:
89076.46
Organism:
Homo sapiens (Human)
Description:
Human KDM5D (1-775 aa)
Residue:
775
  
Inhibitor
Name:
BDBM60875
Synonyms:
3-((6-(4,5-Dihydro-1H-benzo[d]azepin-3(2H)-yl)-2-(pyridin-2-yl)pyrimidin-4-yl)amino)propanoic acid GSK J1 GSKJ1
Type:
Emp. Form.:
C22H23N5O2
Mol. Mass.:
389.4503
SMILES:
OC(=O)CCNc1cc(nc(n1)-c1ccccn1)N1CCc2ccccc2CC1
: