Target
Lysine-specific demethylase 4C
Ligand
BDBM195612
Substrate
Meas. Tech.
Demethylase AlphaScreen Assay
pH
7.5±n/a
IC50
5.1e+3±n/a nM
Comments
extracted
Citation
 Johansson, CVelupillai, STumber, ASzykowska, AHookway, ESNowak, RPStrain-Damerell, CGileadi, CPhilpott, MBurgess-Brown, NWu, NKopec, JNuzzi, ASteuber, HEgner, UBadock, VMunro, SLaThangue, NBWestaway, SBrown, JAthanasou, NPrinjha, RBrennan, PEOppermann, U Structural analysis of human KDM5B guides histone demethylase inhibitor development. Nat Chem Biol 12:539-45 (2016)  
Target
Name:
Lysine-specific demethylase 4C
Synonyms:
GASC-1 protein Gene amplified in squamous cell carcinoma 1 protein JMJD2C Jumonji domain-containing protein 2C KDM4C_HUMAN | KIAA0780
Type:
Protein
Mol. Mass.:
119979.01
Organism:
Homo sapiens (Human)
Description:
Q9H3R0
Residue:
1056
  
Inhibitor
Name:
BDBM195612
Synonyms:
GSK467
Type:
Small organic molecule
Emp. Form.:
C17H13N5O2
Mol. Mass.:
319.3174
SMILES:
O=c1[nH]c(Oc2cnn(Cc3ccccc3)c2)nc2cnccc12
: