Target
Alpha-1,6-mannosyl-glycoprotein 2-beta-N-acetylglucosaminyltransferase
Ligand
BDBM289045
Substrate
Meas. Tech.
MGAT LCMS Assay
pH
7.4±n/a
IC50
2.00±n/a nM
Comments
extracted
Citation
 Ahmad, S Tetrazolone-substituted dihydropyridinone MGAT2 inhibitors US Patent  US10093650 Publication Date 10/9/2018 
Target
Name:
Alpha-1,6-mannosyl-glycoprotein 2-beta-N-acetylglucosaminyltransferase
Synonyms:
2.4.1.143 GNT-II MGAT2 Mannoside acetylglucosaminyltransferase 2 Monoacylglycerol acyltransferase type 2 (h-MGAT2) h-MGAT2 (human monoacylglycerol acyltransferase type 2)
Type:
Mol. Mass.:
51567.80
Organism:
Homo sapiens (Human)
Description:
Q10469
Residue:
447
  
Inhibitor
Name:
BDBM289045
Synonyms:
US10093650, Example 22
Type:
Small organic molecule
Emp. Form.:
C23H20F7N7O3
Mol. Mass.:
575.4388
SMILES:
Fc1cc(OCCCC(F)(F)F)ccc1[C@@]1(CC(c2ncc([nH]2)C2CC2)=C(C(=O)N1)n1nn[nH]c1=O)C(F)(F)F
: