Target
Histone deacetylase 6 [440-798]
Ligand
BDBM25150
Substrate
Meas. Tech.
HDAC6 fluorescence anisotropy assay
Temperature
298.15±n/a K
Ki
1.1±0.2 nM
IC50
1.9±0.3 nM
Comments
extracted
Citation
 Hai, YUniversity of Pennsylvania,, DW Histone deacetylase 6 structure and molecular basis of catalysis and inhibition Nat Chem Biol 12:741-747 (2016)  
Target
Name:
Histone deacetylase 6 [440-798]
Synonyms:
Catalytic domain 2 (zCD2) | zCD2
Type:
Mol. Mass.:
39850.25
Organism:
Danio rerio
Description:
F8W4B7[440-798]
Residue:
359
  
Inhibitor
Name:
BDBM25150
Synonyms:
(2E)-N-hydroxy-3-[3-(phenylsulfamoyl)phenyl]prop-2-enamide Belinostat PXD101
Type:
Small organic molecule
Emp. Form.:
C15H14N2O4S
Mol. Mass.:
318.348
SMILES:
ONC(=O)\C=C\c1cccc(c1)S(=O)(=O)Nc1ccccc1
: