Target
Histone deacetylase 6 [440-798]
Ligand
BDBM50123957
Substrate
Meas. Tech.
HDAC6 fluorescence anisotropy assay
Temperature
298.15±n/a K
Ki
4.3±0.5 nM
IC50
7.5±0.9 nM
Comments
extracted
Citation
 Hai, YUniversity of Pennsylvania,, DW Histone deacetylase 6 structure and molecular basis of catalysis and inhibition Nat Chem Biol 12:741-747 (2016)  
Target
Name:
Histone deacetylase 6 [440-798]
Synonyms:
Catalytic domain 2 (zCD2) | zCD2
Type:
Mol. Mass.:
39850.25
Organism:
Danio rerio
Description:
F8W4B7[440-798]
Residue:
359
  
Inhibitor
Name:
BDBM50123957
Synonyms:
(E)-5-(3-Benzenesulfonylamino-phenyl)-pent-2-en-4-ynoic acid hydroxyamide 5-(4-Benzenesulfonylamino-phenyl)-pent-2-en-4-ynoic acid hydroxyamide Oxamflatin
Type:
Small organic molecule
Emp. Form.:
C17H14N2O4S
Mol. Mass.:
342.369
SMILES:
ONC(=O)\C=C\C#Cc1ccc(NS(=O)(=O)c2ccccc2)cc1
: