Target
D-amino-acid oxidase
Ligand
BDBM196659
Substrate
Meas. Tech.
Inhibition Assay
pH
7.5±n/a
Temperature
298.15±n/a K
IC50
2.1±n/a nM
Comments
extracted
Citation
 Hondo, TNakanishi, KNiimi, TWarizaya, MNamatame, IHarada, K Dihydroxy aromatic heterocyclic compound US Patent  US9212147 Publication Date 12/15/2015 
Target
Name:
D-amino-acid oxidase
Synonyms:
D-amino-acid oxidase (DAAO) DAMOX OXDA_HUMAN
Type:
Homodimer
Mol. Mass.:
39476.06
Organism:
Homo sapiens (Human)
Description:
P14920
Residue:
347
  
Inhibitor
Name:
BDBM196659
Synonyms:
US9212147, 16
Type:
Small organic molecule
Emp. Form.:
C13H14N2O3
Mol. Mass.:
246.2619
SMILES:
OCc1cccc(CCc2cc(O)c(=O)[nH]n2)c1
: