Target
D-amino-acid oxidase
Ligand
BDBM196661
Substrate
Meas. Tech.
Inhibition Assay
pH
7.5±n/a
Temperature
298.15±n/a K
IC50
2.2±n/a nM
Comments
extracted
Citation
 Hondo, TNakanishi, KNiimi, TWarizaya, MNamatame, IHarada, K Dihydroxy aromatic heterocyclic compound US Patent  US9212147 Publication Date 12/15/2015 
Target
Name:
D-amino-acid oxidase
Synonyms:
D-amino-acid oxidase (DAAO) DAMOX OXDA_HUMAN
Type:
Homodimer
Mol. Mass.:
39476.06
Organism:
Homo sapiens (Human)
Description:
P14920
Residue:
347
  
Inhibitor
Name:
BDBM196661
Synonyms:
US10202399, Example 21 US11129828, Example 17 US9290456, 17 | US9931340, Example 17
Type:
Small organic molecule
Emp. Form.:
C12H10F2N2O2
Mol. Mass.:
252.2168
SMILES:
Oc1cc(CCc2ccc(F)cc2F)n[nH]c1=O
: