Target
ALK tyrosine kinase receptor
Ligand
BDBM196854
Substrate
Meas. Tech.
Enzyme Inhibition Assay
pH
7.4±n/a
Temperature
298.15±n/a K
Ki
<1±n/a nM
Comments
extracted
Citation
 Vasudevan, APenning, TDChen, HLiang, BWang, SWu, FShen, YLiu, CZou, ZPliushchev, M Bicyclic carboxamide inhibitors of kinases US Patent  US9212192 Publication Date 12/15/2015 
Target
Name:
ALK tyrosine kinase receptor
Synonyms:
ALK ALK_HUMAN CD_antigen: CD246
Type:
Protein
Mol. Mass.:
176453.10
Organism:
Homo sapiens (Human)
Description:
Q9UM73
Residue:
1620
  
Inhibitor
Name:
BDBM196854
Synonyms:
US9212192, 17
Type:
Small organic molecule
Emp. Form.:
C24H24Cl2N8O
Mol. Mass.:
511.406
SMILES:
Cc1cc(Nc2nc(Cc3c(Cl)cccc3Cl)n3cnnc3c2C(N)=O)ccc1N1CCNCC1
: