Target
Histone deacetylase 1
Ligand
BDBM50020910
Substrate
Meas. Tech.
Enzyme Assay
IC50
13±n/a nM
Citation
 Nan, FChen, FZhang, YLi, JZhou, YSu, MDing, JMeng, LXie, XWang, S Thiazole compounds, methods for preparation and use thereof US Patent  US9216962 Publication Date 12/22/2015 
Target
Name:
Histone deacetylase 1
Synonyms:
Cereblon/Histone deacetylase 1 HDAC1 Histone deacetylase 1 (HDAC1) RPD3L1
Type:
Enzyme
Mol. Mass.:
55090.27
Organism:
Homo sapiens (Human)
Description:
Q13547
Residue:
482
  
Inhibitor
Name:
BDBM50020910
Synonyms:
CHEMBL3287268 | US9216962, CFH395
Type:
Small organic molecule
Emp. Form.:
C17H22N4O3S2
Mol. Mass.:
394.512
SMILES:
CC(C)\C=C\c1sc(nc1C(=O)NCCCCC(=O)NO)-c1nccs1
: