Target
Adenosine receptor A1
Ligand
BDBM21173
Substrate
Meas. Tech.
A1 Adenosine Receptor Binding Assay
pH
7.4±n/a
Temperature
298.15±n/a K
Kd
3±n/a nM
Comments
extracted
Citation
 Cosimelli, BGreco, GLaneri, SNovellino, ESacchi, ATrincavelli, MLGiacomelli, CTaliani, SDa Settimo, FMartini, C 4-amino-6-alkyloxy-2-alkylthiopyrimidine derivatives as novel non-nucleoside agonists for the adenosine A1 receptor. Chem Biol Drug Des 88:724-729 (2016)  
Target
Name:
Adenosine receptor A1
Synonyms:
A1 adenosine receptor (hA1) AA1R_HUMAN ADORA1 Adenosine A1-receptor Adenosine receptor A1 (hA1) | Adenosine transporter (AdT)
Type:
G Protein-Coupled Receptor (GPCR)
Mol. Mass.:
36520.92
Organism:
Homo sapiens (Human)
Description:
P30542
Residue:
326
  
Inhibitor
Name:
BDBM21173
Synonyms:
1,3-dipropyl-8-cyclopentylxanthine CHEMBL183 PD116948 | [3H]DPCPX
Type:
radiolabeled ligand
Emp. Form.:
C16H24N4O2
Mol. Mass.:
304.3874
SMILES:
CCCn1c2nc([nH]c2c(=O)n(CCC)c1=O)C1CCCC1
: