Target
Macrophage colony-stimulating factor 1 receptor [555-568]
Ligand
BDBM198849
Substrate
Meas. Tech.
Fluorescence Polarization Competition Immunoassay
pH
7.5±n/a
IC50
4.4±n/a nM
Comments
extracted
Citation
 Illig, CRBallentine, SKChen, JDesjarlais, RLMeegalla, SKWall, MWilson, K Inhibitors of c-fms kinase US Patent  US9221797 Publication Date 12/29/2015 
Target
Name:
Macrophage colony-stimulating factor 1 receptor [555-568]
Synonyms:
CSF1R FMS FMS Substrate Peptide (aa 555-568) | Macrophage colony-stimulating factor 1 receptor (CSF1R) or (c-fms)
Type:
Peptide
Mol. Mass.:
1619.64
Organism:
Homo sapiens (Human)
Description:
P07333 aa 555-568
Residue:
14
SYEGNSYTFIDPTQ
  
Inhibitor
Name:
BDBM198849
Synonyms:
US9221797, 12
Type:
Small organic molecule
Emp. Form.:
C24H26N4O5
Mol. Mass.:
450.487
SMILES:
CC(=O)OCC(COC(C)=O)c1ccc(NC(=O)c2nc(c[nH]2)C#N)c(c1)C1=CCCCC1
: