Target
Macrophage colony-stimulating factor 1 receptor [555-568]
Ligand
BDBM198874
Substrate
Meas. Tech.
Fluorescence Polarization Competition Immunoassay
pH
7.5±n/a
IC50
1.5±n/a nM
Comments
extracted
Citation
 Illig, CRBallentine, SKChen, JDesjarlais, RLMeegalla, SKWall, MWilson, K Inhibitors of c-fms kinase US Patent  US9221797 Publication Date 12/29/2015 
Target
Name:
Macrophage colony-stimulating factor 1 receptor [555-568]
Synonyms:
CSF1R FMS FMS Substrate Peptide (aa 555-568) | Macrophage colony-stimulating factor 1 receptor (CSF1R) or (c-fms)
Type:
Peptide
Mol. Mass.:
1619.64
Organism:
Homo sapiens (Human)
Description:
P07333 aa 555-568
Residue:
14
SYEGNSYTFIDPTQ
  
Inhibitor
Name:
BDBM198874
Synonyms:
US9221797, 47
Type:
Small organic molecule
Emp. Form.:
C23H28N4O3
Mol. Mass.:
408.4934
SMILES:
COC[C@H](O)Cc1ccc(NC(=O)c2ncc([nH]2)C#N)c(c1)C1=CCC(C)(C)CC1
: