Target
Tyrosine-protein phosphatase non-receptor type 1
Ligand
BDBM199179
Substrate
Meas. Tech.
PTP pNPP Assay
pH
7±n/a
Temperature
298.15±n/a K
IC50
87±2 nM
Comments
extracted
Citation
 Zhang, ZZhang, S Inhibitors of protein tyrosine phosphatases US Patent  US9217012 Publication Date 12/22/2015 
Target
Name:
Tyrosine-protein phosphatase non-receptor type 1
Synonyms:
PTN1_HUMAN PTPN1 Protein tyrosine phosphatase-1B (PTP1B) Protein-tyrosine phosphatase 1B (PTP1B) Tyrosine-protein phosphatase non-receptor type 1 (PTP1B)
Type:
Protein phosphatase
Mol. Mass.:
49963.76
Organism:
Homo sapiens (Human)
Description:
Human recombinant GST-fusion PTP1B (1-435).
Residue:
435
  
Inhibitor
Name:
BDBM199179
Synonyms:
US9217012, 8
Type:
Small organic molecule
Emp. Form.:
C36H44F2N5O8P
Mol. Mass.:
743.7338
SMILES:
CCc1ccc(cc1)C(=O)NCCCCC(NC(=O)C(Cc1ccc(cc1)C(F)(F)P(O)(O)=O)NC(=O)C(Cc1ccccc1)NC(C)=O)C(N)=O
: