Target
Kappa-type opioid receptor
Ligand
BDBM199410
Substrate
Meas. Tech.
Functional Assay
pH
7.4±n/a
Temperature
298.15±n/a K
EC50
1.83±0.10 nM
Comments
extracted
Citation
 Kyle, DJTafesse, L Buprenorphine analogs US Patent  US9221831 Publication Date 12/29/2015 
Target
Name:
Kappa-type opioid receptor
Synonyms:
K-OR-1 Kappa-opioid receptor (KOR) Kappa-type opioid receptor (KOR) OPIATE Kappa OPRK1 kappa opioid receptor (KOR)
Type:
G Protein-Coupled Receptor (GPCR)
Mol. Mass.:
42648.76
Organism:
Homo sapiens (Human)
Description:
P41145
Residue:
380
  
Inhibitor
Name:
BDBM199410
Synonyms:
US9221831, 75
Type:
Small organic molecule
Emp. Form.:
C32H38N2O5
Mol. Mass.:
530.6545
SMILES:
CO[C@]12CC[C@@]3(C[C@@H]1COCc1ccc(cc1)C(N)=O)[C@H]1Cc4ccc(O)c5O[C@@H]2[C@]3(CCN1CC1CC1)c45
: