Target
Cyclin-dependent kinase 2/G1/S-specific cyclin-E1
Ligand
BDBM5723
Substrate
GST-Rb fusion protein
Meas. Tech.
Kinase Inhibition assay
pH
8±n/a
Temperature
303.15±n/a K
IC50
2±n/a nM
Citation
 Misra, RNXiao, HYWilliams, DKKim, KSLu, SKeller, KAMulheron, JGBatorsky, RTokarski, JSSack, JSKimball, SDLee, FYWebster, KR Synthesis and biological activity of N-aryl-2-aminothiazoles: potent pan inhibitors of cyclin-dependent kinases. Bioorg Med Chem Lett 14:2973-7 (2004)  
Target
Name:
Cyclin-dependent kinase 2/G1/S-specific cyclin-E1
Synonyms:
CDK2/CycE CDK2/E Cyclin-Dependent Kinase 2 (CDK2) Cyclin-dependent kinase 2/cyclin E1
Type:
Protein
Mol. Mass.:
Description:
Components:
This complex has 2 components.
Component 1
Name:
Cyclin-dependent kinase 2
Synonyms:
CDK2 CDK2_HUMAN Cell division protein kinase 2 Protein cereblon/Cyclin-dependent kinase 2 | p33 protein kinase
Type:
Enzyme Subunit
Mol. Mass.:
33938.17
Organism:
Homo sapiens (Human)
Description:
P24941
Residue:
298
  
Component 2
Name:
G1/S-specific cyclin-E1
Synonyms:
CCNE CCNE1_HUMAN
Type:
Enzyme Subunit
Mol. Mass.:
47073.17
Organism:
Homo sapiens (Human)
Description:
Residue:
410
  
Inhibitor
Name:
BDBM5723
Synonyms:
2-aminothiazole 7 | 5-{[(5-tert-butyl-1,3-oxazol-2-yl)methyl]sulfanyl}-N-(pyridin-2-yl)-1,3-thiazol-2-amine
Type:
Small organic molecule
Emp. Form.:
C16H18N4OS2
Mol. Mass.:
346.47
SMILES:
CC(C)(C)c1cnc(CSc2cnc(Nc3ccccn3)s2)o1
:
Substrate
Name:
GST-Rb fusion protein
Synonyms:
Glutathione S-transferase (GST)-retinoblastoma (Rb) fusion RB1 Rb | retinoblastoma
Type:
Other Protein Type
Mol. Mass.:
106410.17
Organism:
Homo sapiens (Human)
Description:
GST-60 kDa Rb fusion protein (comprising amino acids 378 to 928 of retinoblastoma)
Residue:
928