Target
Aldo-keto reductase family 1 member B1
Ligand
BDBM200221
Substrate
Meas. Tech.
IC50-Activity Assay (AR)
pH
7±n/a
IC50
2.17e+4± 2.3e+3 nM
Comments
extracted
Citation
 Cousido-Siah, ARuiz, FXFranflík, JGiménez-Dejoz, JMitschler, AKamlar, MVesely´, JAjani, HParés, XFarrés, JHobza, PPodjarny, AD IDD388 Polyhalogenated Derivatives as Probes for an Improved Structure-Based Selectivity of AKR1B10 Inhibitors ACS Chem Biol 11:2693-2705 (2016)  
Target
Name:
Aldo-keto reductase family 1 member B1
Synonyms:
AKR1B1 ALDR_HUMAN AR Aldose Reductase (ALR2) Aldose reductase (AR)
Type:
Protein
Mol. Mass.:
35855.50
Organism:
Homo sapiens (Human)
Description:
P15121. 4LAU; 2IKI; 4LB4; 2FZD; 2FZ8; 1US0
Residue:
316
  
Inhibitor
Name:
BDBM200221
Synonyms:
2-(5-chloro-2-(((perbromophenyl)methyl)carbamoyl)phenoxy)acetic acid | MK204
Type:
Small organic molecule
Emp. Form.:
C16H9Br5ClNO4
Mol. Mass.:
714.22
SMILES:
OC(=O)COc1cc(Cl)ccc1C(=O)NCc1c(Br)c(Br)c(Br)c(Br)c1Br
: