Target
Aldo-keto reductase family 1 member B10
Ligand
BDBM50029207
Substrate
Meas. Tech.
IC50-Activity Assay (AKR1B10)
pH
7±n/a
IC50
80±n/a nM
Comments
extracted
Citation
 Cousido-Siah, ARuiz, FXFranflík, JGiménez-Dejoz, JMitschler, AKamlar, MVesely´, JAjani, HParés, XFarrés, JHobza, PPodjarny, AD IDD388 Polyhalogenated Derivatives as Probes for an Improved Structure-Based Selectivity of AKR1B10 Inhibitors ACS Chem Biol 11:2693-2705 (2016)  
Target
Name:
Aldo-keto reductase family 1 member B10
Synonyms:
AK1BA_HUMAN AKR1B11 ARP Aldo-keto reductase family 1 member B10 (AKR1B10) Aldose reductase-like SI reductase hARP
Type:
Protein
Mol. Mass.:
36024.67
Organism:
Homo sapiens (Human)
Description:
O60218. 1ZUA; 4JII; 4GQ0
Residue:
316
  
Inhibitor
Name:
BDBM50029207
Synonyms:
(E)-3-(3,4-Dihydroxy-phenyl)-acrylic acid phenethyl ester 3-(3,4-Dihydroxy-phenyl)-acrylic acid phenethyl ester CHEMBL319244 caffeic acid phenethylester caffeic acid phenylethylester phenethyl 3-(3,4-dihydroxyphenyl)acrylate | phenethyl caffeate
Type:
Small organic molecule
Emp. Form.:
C17H16O4
Mol. Mass.:
284.3065
SMILES:
Oc1ccc(\C=C\C(=O)OCCc2ccccc2)cc1O
: