Target
Cystic fibrosis transmembrane conductance regulator
Ligand
BDBM50017712
Substrate
EC50
>50000±n/a nM
Citation
 PubChem, PC Phenotypic Assay to Identify Small Molecules that Upregulate Production of hCFTR in HeLa Cells PubChem Bioassay (2016)[AID] 
Target
Name:
Cystic fibrosis transmembrane conductance regulator
Synonyms:
ABCC7 CFTR Channel conductance-controlling ATPase | cAMP-dependent chloride channel
Type:
Enzyme Catalytic Domain
Mol. Mass.:
168171.30
Organism:
Homo sapiens (Human)
Description:
gi_90421313
Residue:
1480
  
Inhibitor
Name:
BDBM50017712
Synonyms:
(-)-reserpine 3,4,5-trimethoxybenzoyl methyl reserpate CHEMBL772 RESERPINE Serpalan methyl (3beta,16beta,17alpha,18beta,20alpha)-11,17-dimethoxy-18-[(3,4,5-trimethoxybenzoyl)oxy]yohimban-16-carboxylate
Type:
Small organic molecule
Emp. Form.:
C33H40N2O9
Mol. Mass.:
608.6787
SMILES:
CO[C@H]1[C@@H](C[C@@H]2CN3CCc4c([nH]c5cc(OC)ccc45)[C@H]3C[C@@H]2[C@@H]1C(=O)OC)OC(=O)c1cc(OC)c(OC)c(OC)c1
: