Target
Amyloid-beta precursor protein
Ligand
BDBM200305
Substrate
Meas. Tech.
Electrochemiluminescence (ECL)-based Immunoassay
pH
7±n/a
Temperature
310.15±n/a K
IC50
5.8±n/a nM
Comments
extracted
Citation
 Wu, WBurnett, DA Gamma secretase inhibitors US Patent  US9226927 Publication Date 1/5/2016 
Target
Name:
Amyloid-beta precursor protein
Synonyms:
A4 ABPP AICD-50 AICD-59 AID(57) APP Alzheimer disease amyloid protein Amyloid beta Protein Amyloid beta protein Abeta(1-42) Amyloid intracellular domain 57 Amyloid protein (Abeta42b) Beta amyloid A4 protein Beta-APP42 Beta-amyloid protein 42 C83 CVAP Gamma Secretase Gamma-CTF(57) Gamma-secretase Gamma-secretase C-terminal fragment 57 P3(40) PN-II Protease nexin-II S-APP-beta Soluble APP-beta | beta-Amyloid Precursor Protein (APP)
Type:
Single-pass type I membrane protein
Mol. Mass.:
86890.41
Organism:
Homo sapiens (Human)
Description:
P05067
Residue:
770
  
Inhibitor
Name:
BDBM200305
Synonyms:
US9226927, 14
Type:
Small organic molecule
Emp. Form.:
C24H23ClF2N2O7S2
Mol. Mass.:
589.028
SMILES:
Cc1nc(CS(=O)(=O)CC[C@@H]2OCC[C@@]3(C2COc2c(F)ccc(F)c32)S(=O)(=O)c2ccc(Cl)cc2)no1
: