Target
Amyloid-beta precursor protein
Ligand
BDBM200313
Substrate
Meas. Tech.
Electrochemiluminescence (ECL)-based Immunoassay
pH
7±n/a
Temperature
310.15±n/a K
IC50
16.5±n/a nM
Comments
extracted
Citation
 Wu, WBurnett, DA Gamma secretase inhibitors US Patent  US9226927 Publication Date 1/5/2016 
Target
Name:
Amyloid-beta precursor protein
Synonyms:
A4 ABPP AICD-50 AICD-59 AID(57) APP Alzheimer disease amyloid protein Amyloid beta Protein Amyloid beta protein Abeta(1-42) Amyloid intracellular domain 57 Amyloid protein (Abeta42b) Beta amyloid A4 protein Beta-APP42 Beta-amyloid protein 42 C83 CVAP Gamma Secretase Gamma-CTF(57) Gamma-secretase Gamma-secretase C-terminal fragment 57 P3(40) PN-II Protease nexin-II S-APP-beta Soluble APP-beta | beta-Amyloid Precursor Protein (APP)
Type:
Single-pass type I membrane protein
Mol. Mass.:
86890.41
Organism:
Homo sapiens (Human)
Description:
P05067
Residue:
770
  
Inhibitor
Name:
BDBM200313
Synonyms:
US9226927, 25h
Type:
Small organic molecule
Emp. Form.:
C26H24ClF2NO7S2
Mol. Mass.:
600.051
SMILES:
COc1ccc(cn1)S(=O)(=O)CC[C@@H]1OCC[C@@]2(C1COc1c(F)ccc(F)c21)S(=O)(=O)c1ccc(Cl)cc1
: