Target
6-phosphofructo-2-kinase/fructose-2,6-bisphosphatase 4
Ligand
BDBM200917
Substrate
Meas. Tech.
Kinase Assay (Method B)
IC50
390±n/a nM
Citation
 Bystrom, SHedgecock, CHoman, ELundback, TMartinsson, JSari, MFarnegardh, KJonsson, M Sulfonamide compounds US Patent  US9233946 Publication Date 1/12/2016 
Target
Name:
6-phosphofructo-2-kinase/fructose-2,6-bisphosphatase 4
Synonyms:
6-phosphofructo-2-kinase/fructose-2,6-bisphosphatase 4 (PFKFB4) PFKFB4
Type:
Enzyme
Mol. Mass.:
54039.68
Organism:
Homo sapiens (Human)
Description:
Q16877
Residue:
469
  
Inhibitor
Name:
BDBM200917
Synonyms:
US9233946, 16
Type:
Small organic molecule
Emp. Form.:
C19H15N5O2S
Mol. Mass.:
377.42
SMILES:
O=S(=O)(Nc1cccc(c1)-c1nnn[nH]1)c1cccc(c1)-c1ccccc1
: