Target
Sodium- and chloride-dependent glycine transporter 1
Ligand
BDBM202272
Substrate
Meas. Tech.
Radioligand Binding Assay
Ki
<0.1±n/a nM
Citation
 Pohlki, FLange, UAmberg, WOchse, MBehl, BHornberger, WMezler, MHutchins, CWTurner, S Phenalkylamine derivatives, pharmaceutical compositions containing them, and their use in therapy US Patent  US9238619 Publication Date 1/19/2016 
Target
Name:
Sodium- and chloride-dependent glycine transporter 1
Synonyms:
GlyT-1 Glycine Transporters (GlyT1c) SC6A9_HUMAN Sodium- and chloride-dependent glycine transporter 1 Sodium- and chloride-dependent glycine transporter 1 (GlyT1c) Solute carrier family 6 member 9
Type:
Enzyme
Mol. Mass.:
78270.54
Organism:
Homo sapiens (Human)
Description:
P48067
Residue:
706
  
Inhibitor
Name:
BDBM202272
Synonyms:
US9238619, 30
Type:
Small organic molecule
Emp. Form.:
C23H29ClN4O3S
Mol. Mass.:
477.019
SMILES:
CN(C)CC(Cc1ccccc1)c1cc(OCCNS(=O)(=O)c2cnn(C)c2)ccc1Cl
: