Target
Epidermal growth factor receptor
Ligand
BDBM202374
Substrate
Meas. Tech.
Omnia Assay
pH
7.5±n/a
Temperature
298.15±n/a K
IC50
650±n/a nM
Comments
extracted
Citation
 Lee, KNiu, DPetter, RCSingh, J Heteroaryl compounds and uses thereof US Patent  US9238629 Publication Date 1/19/2016 
Target
Name:
Epidermal growth factor receptor
Synonyms:
EGF Receptor Substrate EGFR_HUMAN ERBB1 Epidermal Growth Factor Receptor erbB-1 Epidermal growth factor receptor (EGFR) HER1 Proto-oncogene c-ErbB-1 Tyrosine-Protein Kinase ErbB-1
Type:
Receptor Kinase Domain
Mol. Mass.:
134279.59
Organism:
Homo sapiens (Human)
Description:
P00533
Residue:
1210
  
Inhibitor
Name:
BDBM202374
Synonyms:
US10081606, Compound I-6 US9238629, I-6 | US9765038, Compound I-6
Type:
Small organic molecule
Emp. Form.:
C21H19BrN4O4
Mol. Mass.:
471.304
SMILES:
COc1cccc(Nc2ncc(Br)c(Oc3cccc(NC(=O)C=C)c3)n2)c1OC
: