Target
Vascular endothelial growth factor receptor 3
Ligand
BDBM202396
Substrate
Meas. Tech.
VEGFR3 Biochemical Assay
pH
7.4±n/a
IC50
9±n/a nM
Comments
extracted
Citation
 Foitzik, RCMorrow, BJHemley, CFLunniss, GECamerino, MAGaname, DStupple, PALessene, RKersten, WJHarvey, AJHolmes, IP VEGFR3 inhibitors US Patent  US9238644 Publication Date 1/19/2016 
Target
Name:
Vascular endothelial growth factor receptor 3
Synonyms:
FLT-4 Fms-like tyrosine kinase 4 VEGFR-3 VGFR3_HUMAN Vascular endothelial growth factor receptor 3 (VEGFR-3) | Vascular endothelial growth factor receptor 3 (VEGFR3)
Type:
Protein
Mol. Mass.:
152749.58
Organism:
Homo sapiens (Human)
Description:
P35916-2
Residue:
1363
  
Inhibitor
Name:
BDBM202396
Synonyms:
US9238644, 3
Type:
Small organic molecule
Emp. Form.:
C29H32F3N5O
Mol. Mass.:
523.5925
SMILES:
CN1CCC(CC1)c1ccc(Nc2ncc(c(CCc3ccccc3C3(CC3)C(N)=O)n2)C(F)(F)F)cc1
: