Target
Vascular endothelial growth factor receptor 3
Ligand
BDBM202440
Substrate
Meas. Tech.
VEGFR3 Biochemical Assay
pH
7.4±n/a
IC50
3±n/a nM
Comments
extracted
Citation
 Foitzik, RCMorrow, BJHemley, CFLunniss, GECamerino, MAGaname, DStupple, PALessene, RKersten, WJHarvey, AJHolmes, IP VEGFR3 inhibitors US Patent  US9238644 Publication Date 1/19/2016 
Target
Name:
Vascular endothelial growth factor receptor 3
Synonyms:
FLT-4 Fms-like tyrosine kinase 4 VEGFR-3 VGFR3_HUMAN Vascular endothelial growth factor receptor 3 (VEGFR-3) | Vascular endothelial growth factor receptor 3 (VEGFR3)
Type:
Protein
Mol. Mass.:
152749.58
Organism:
Homo sapiens (Human)
Description:
P35916-2
Residue:
1363
  
Inhibitor
Name:
BDBM202440
Synonyms:
US9238644, 45
Type:
Small organic molecule
Emp. Form.:
C20H23ClN6O
Mol. Mass.:
398.889
SMILES:
Cn1cc(Nc2ncc(Cl)c(CCc3ccccc3C(C)(C)C(N)=O)n2)cn1
: