Target
RAF proto-oncogene serine/threonine-protein kinase [Y340E,Y341E]
Ligand
BDBM202852
Substrate
Meas. Tech.
In Vitro Enzyme Assay
pH
7.5±n/a
Temperature
298.15±n/a K
IC50
0.185±n/a nM
Comments
extracted
Citation
 Barsanti, PABurger, MLou, YNishiguchi, GPolyakov, VRamurthy, SRico, ASetti, LSmith, ATaft, BTanner, HDiPesa, AYusuff, N Biaryl amide compounds as kinase inhibitors US Patent  US9242969 Publication Date 1/26/2016 
Target
Name:
RAF proto-oncogene serine/threonine-protein kinase [Y340E,Y341E]
Synonyms:
C-RAF RAF RAF1 | RAF1_HUMAN
Type:
Mol. Mass.:
73012.38
Organism:
Homo sapiens (Human)
Description:
P04049[Y340E,Y341E]
Residue:
648
  
Inhibitor
Name:
BDBM202852
Synonyms:
US10245267, Example 825 US9242969, 205 | US9694016, 825
Type:
Small organic molecule
Emp. Form.:
C26H24F3N5O2
Mol. Mass.:
495.4963
SMILES:
C[C@@H]1COCCN1c1nc(cn2ccnc12)-c1cc(NC(=O)c2cccc(c2)C(F)(F)F)ccc1C
: