Target
Large envelope protein
Ligand
BDBM289752
Substrate
Meas. Tech.
HBsAg Assay
Temperature
298.15±n/a K
IC50
6.00±n/a nM
Comments
extracted
Citation
 Han, XJiang, MYang, S 2-oxo-6,7-dihydrobenzo[a]quinolizine-3-carboxylic acid derivatives for the treatment and prophylaxis of hepatitis B virus infection US Patent  US10093671 Publication Date 10/9/2018 
Target
Name:
Large envelope protein
Synonyms:
HBSAG_HBVD3 | S
Type:
Mol. Mass.:
42772.52
Organism:
Hepatitis B virus
Description:
P03138
Residue:
389
  
Inhibitor
Name:
BDBM289752
Synonyms:
US10093671, Example 21
Type:
Small organic molecule
Emp. Form.:
C30H36N2O7S
Mol. Mass.:
568.681
SMILES:
COc1cc-2c(CC(c3cccs3)n3cc(C(O)=O)c(=O)cc-23)cc1OCCCCCCNC(=O)OC(C)(C)C
: