Target
Genome polyprotein
Ligand
BDBM203919
Substrate
Meas. Tech.
Inhibition Assay
pH
7.3±n/a
Temperature
298.15±n/a K
IC50
3±n/a nM
Comments
extracted
Citation
 Girijavallabhan, VBogen, SPan, WDang, QDavies, I 2′-cyano substituted nucleoside derivatives and methods of use thereof for the treatment of viral diseases US Patent  US9242988 Publication Date 1/26/2016 
Target
Name:
Genome polyprotein
Synonyms:
Genome polyprotein POLG_HCVBK | RNA-directed RNA polymerase (NS5B)
Type:
Protein
Mol. Mass.:
327252.46
Organism:
Hepatitis C virus genotype 1b (isolate BK) (HCV)
Description:
P26663
Residue:
3010
  
Inhibitor
Name:
BDBM203919
Synonyms:
US9242988, 1
Type:
Small organic molecule
Emp. Form.:
C13H14N5O12P3
Mol. Mass.:
525.2
SMILES:
C[C@@]1(C#N)[C@H](O)[C@@H](COP([O-])(=O)OP([O-])(=O)OP([O-])([O-])=O)O[C@H]1c1ccc2c(N)ncnn12
: