Target
Protein-glutamine gamma-glutamyltransferase 2
Ligand
BDBM204882
Substrate
Meas. Tech.
TGM2 Inhibitory Activity Assay
pH
7.5±n/a
Temperature
298.15±n/a K
IC50
1100±n/a nM
Comments
extracted
Citation
 Szillat, HLeeuw, TLorenz, M Isothiazolopyridine-2-carboxamides and their use as pharmaceuticals US Patent  US9260454 Publication Date 2/16/2016 
Target
Name:
Protein-glutamine gamma-glutamyltransferase 2
Synonyms:
Protein-glutamine gamma-glutamyltransferase TGM2 Tissue transglutaminase Transglutaminase 2 (TGM2) Transglutaminase-2
Type:
Protein
Mol. Mass.:
77309.30
Organism:
Homo sapiens (Human)
Description:
P21980
Residue:
687
  
Inhibitor
Name:
BDBM204882
Synonyms:
US9260454, 6
Type:
Small organic molecule
Emp. Form.:
C18H16N5O2S
Mol. Mass.:
366.417
SMILES:
O=C(N1CCN(CC1)c1ccc(cc1)C#N)n1sc2[nH]cccc2c1=O
: