Target
Protein-glutamine gamma-glutamyltransferase 2
Ligand
BDBM204917
Substrate
Meas. Tech.
TGM2 Inhibitory Activity Assay
pH
7.5±n/a
Temperature
298.15±n/a K
IC50
750±n/a nM
Comments
extracted
Citation
 Szillat, HLeeuw, TLorenz, M Isothiazolopyridine-2-carboxamides and their use as pharmaceuticals US Patent  US9260454 Publication Date 2/16/2016 
Target
Name:
Protein-glutamine gamma-glutamyltransferase 2
Synonyms:
Protein-glutamine gamma-glutamyltransferase TGM2 Tissue transglutaminase Transglutaminase 2 (TGM2) Transglutaminase-2
Type:
Protein
Mol. Mass.:
77309.30
Organism:
Homo sapiens (Human)
Description:
P21980
Residue:
687
  
Inhibitor
Name:
BDBM204917
Synonyms:
US9260454, 83
Type:
Small organic molecule
Emp. Form.:
C15H18N4O5S
Mol. Mass.:
366.392
SMILES:
COCCC(=O)N1CCN(CC1)C(=O)n1sc2[n+]([O-])cccc2c1=O
: