Target
Bromodomain-containing protein 3 [24-144]
Ligand
BDBM205453
Substrate
Meas. Tech.
Bromodomains Assay for DiscoveRx Gene Symbol
Ki
0.059±0.0 nM
Citation
 Tanaka, MRoberts, JMSeo, HSSouza, APaulk, JScott, TGDeAngelo, SLDhe-Paganon, SBradner, JE Design and characterization of bivalent BET inhibitors. Nat Chem Biol 12:1089-1096 (2016)  
Target
Name:
Bromodomain-containing protein 3 [24-144]
Synonyms:
BET bromodomain 3(1) (BRD3(1)) BRD3_HUMAN RING3L
Type:
Mol. Mass.:
14355.47
Organism:
Homo sapiens (Human)
Description:
Q15059 (BRD3, 24-144)
Residue:
121
  
Inhibitor
Name:
BDBM205453
Synonyms:
MTI (35)
Type:
Small organic molecule
Emp. Form.:
C54H66Cl2N10O9S2
Mol. Mass.:
1134.199
SMILES:
Cc1sc-2c(c1C)C(=NC(CC(=O)NCCOCCOCCOCCOCCOCCOCCOCCNC(=O)C[C@@H]1N=C(c3c(C)c(C)sc3-n3c(C)nnc13)c1ccc(Cl)cc1)c1nnc(C)n-21)c1ccc(Cl)cc1
: