Target
Anthranilate--CoA ligase
Ligand
BDBM205458
Substrate
Meas. Tech.
PqsA Spectrophotometric Assay
pH
8±n/a
Ki
205±4 nM
Comments
extracted
Citation
 Ji, CSharma, IPratihar, DHudson, LLMaura, DGuney, TRahme, LGPesci, ECColeman, JPTan, DS Designed Small-Molecule Inhibitors of the Anthranilyl-CoA Synthetase PqsA Block Quinolone Biosynthesis in Pseudomonas aeruginosa. ACS Chem Biol 11:3061-3067 (2016)  
Target
Name:
Anthranilate--CoA ligase
Synonyms:
Anthranilyl-CoA synthetase PqsA (PqsA) pqsA
Type:
Protein
Mol. Mass.:
56603.82
Organism:
Pseudomonas aeruginosa (Gram- Bacteria)
Description:
Residue:
517
  
Inhibitor
Name:
BDBM205458
Synonyms:
Anthranilyl-AMS (1)
Type:
Small organic molecule
Emp. Form.:
C17H18N7O7S
Mol. Mass.:
464.433
SMILES:
Nc1ccccc1C(=O)[N-]S(=O)(=O)OC[C@H]1O[C@H]([C@H](O)[C@@H]1O)n1cnc2c(N)ncnc12
: